IRCForumları - IRC ve mIRC Kullanıcılarının Buluşma Noktası
  kral sohbet




3Beğeni(ler)

Yeni Konu aç Cevapla
 
LinkBack Seçenekler Stil
Alt 15 Nisan 2006, 13:45   #11
Çevrimdışı
Yanıt: Unreal3.2.3 moduller




'CRYPTOLIB=' 'CRYPTOINCLUDES=' 'URL=' MODULEFILE=addwords 'EXLIBS=' custommodule
make[2]: Entering directory `/home/hossohbe/Unreal3.2/src/modules'
make[2]: *** No rule to make target `addwords.c', needed by `custommodule'. Stop.
make[2]: Leaving directory `/home/hossohbe/Unreal3.2/src/modules'
make[1]: *** [custommodule] Error 2
make[1]: Leaving directory `/home/hossohbe/Unreal3.2/src'
make: *** [custommodule] Error 2

  Alıntı ile Cevapla

IRCForumlari.NET Reklamlar
radyo44.com.tr
Alt 06 Haziran 2006, 01:07   #12
Çevrimdışı
Yanıt: Unreal3.2.3 moduller




Acaba ozele yada kanala kullanılan
Bu forumdaki linkleri ve resimleri görebilmek için en az 25 mesajınız olması gerekir.
yada kufurleri otomatik olarak banlayan modul var mı varsa hangisi tesekkurler

  Alıntı ile Cevapla

Alt 18 Haziran 2006, 01:17   #13
Çevrimdışı
Yanıt: Unreal3.2.3 moduller




ne hata verdi nede calıstı
Bu forumdaki linkleri ve resimleri görebilmek için en az 25 mesajınız olması gerekir.

  Alıntı ile Cevapla

Alt 12 Temmuz 2006, 14:48   #14
Çevrimdışı
Yanıt: Unreal3.2.3 moduller




adwords.c:2089: syntax error before "Membership"
adwords.c:2220:34: warning: multi-line string literals are deprecated
adwords.c:2223:34: warning: multi-line string literals are deprecated
adwords.c:2226:34: warning: multi-line string literals are deprecated
adwords.c:2230:34: warning: multi-line string literals are deprecated
adwords.c:2234:34: warning: multi-line string literals are deprecated
[akranx@localhost Unreal3.2]$ lti-line string literals are deprecated
adwords.c:2240:34: warning: multi-line string literals are deprecated
adwords.c:2296:25: warning: multi-line string literals are deprecated
adwords.c:237: storage size of `nickbuf' isn't known
make: *** [custommodule] Error 1

Nerden kaynaklanıyor bu hata?Bilen biri yardım edebilirmi?

  Alıntı ile Cevapla

Alt 23 Temmuz 2006, 19:34   #15
Çevrimdışı
Yanıt: Unreal3.2.3 moduller




merhaba bana unreal 3.2.3 ün özel okuma modülü lazim yardim edermisiniz ?

  Alıntı ile Cevapla

Alt 02 Ağustos 2006, 18:34   #16
Çevrimdışı
Yanıt: Unreal3.2.3 moduller




bendede calışmadı
Bu forumdaki linkleri ve resimleri görebilmek için en az 25 mesajınız olması gerekir.
hatada vermedi ama

  Alıntı ile Cevapla

Alt 02 Ağustos 2006, 19:30   #17
Çevrimdışı
Yanıt: Unreal3.2.3 moduller




unrealircd.conf 'a eklenmesi gerekenleri ekledinizmi?

  Alıntı ile Cevapla

Alt 12 Mayıs 2009, 20:45   #18
Çevrimdışı
Cevap: Yanıt: Unreal3.2.3 moduller




'CRYPTOLIB=' 'CRYPTOINCLUDES=' 'URL=' MODULEFILE=addwords 'EXLIBS=' custommodule
make[2]: Entering directory `/home/hossohbe/Unreal3.2/src/modules'
make[2]: *** No rule to make target `addwords.c', needed by `custommodule'. Stop.
make[2]: Leaving directory `/home/hossohbe/Unreal3.2/src/modules'
make[1]: *** [custommodule] Error 2
make[1]: Leaving directory `/home/hossohbe/Unreal3.2/src'
make: *** [custommodule] Error 2


aynı hatayı bende de verdi neden yapar sizce

  Alıntı ile Cevapla

Alt 12 Mayıs 2009, 20:50   #19
Çevrimdışı
Cevap: Unreal3.2.3 moduller




Kod:   Kodu kopyalamak için üzerine çift tıklayın!
make[2]: *** No rule to make target `addwords.c', needed by `custommodule'. Stop.

yalnış yazmışsın modulun ismini adwords olacak addwords yazmışın dikkat et

  Alıntı ile Cevapla

Alt 12 Mayıs 2009, 22:58   #20
Çevrimdışı
Cevap: Unreal3.2.3 moduller




make[2]: *** [custommodule] Error 1
make[2]: Leaving directory `/home/bilimcha/Unreal3.2/src/modules'
make[1]: *** [custommodule] Error 2
make[1]: Leaving directory `/home/bilimcha/Unreal3.2/src'
make: *** [custommodule] Error 2


gemlik li bu rapor.c yi yapcam ama böle hata veriyo bunu neden yapabilir sence yada komple atayım sana


Kod:   Kodu kopyalamak için üzerine çift tıklayın!
re 'strlcat' ../include/h.h:481: error: expected '=', ',', ';', 'asm' or '__attribute__' before 'strlncat' ../include/h.h:540: error: expected declaration specifiers or '...' before 'size_t' ../include/h.h:540: error: expected declaration specifiers or '...' before 'size_t' ../include/h.h:541: error: expected declaration specifiers or '...' before 'size_t' ../include/h.h:600: error: expected ')' before 'size' rapor.c: In function 'test_chansno': rapor.c:285: error: 'size_t' undeclared (first use in this function) rapor.c:285: error: expected ';' before '__s1_len' rapor.c:285: error: '__s1_len' undeclared (first use in this function) rapor.c:285: warning: incompatible implicit declaration of built-in function 'strlen' rapor.c:285: error: '__s2_len' undeclared (first use in this function) rapor.c:285: error: expected expression before 'const' rapor.c:285: error: expected expression before 'const' rapor.c:285: error: expected expression before 'const' rapor.c:285: error: expected expression before 'const' rapor.c:285: error: expected expression before 'const' rapor.c:285: error: expected expression before 'const' rapor.c:285: error: expected expression before 'const' rapor.c:285: error: expected expression before 'const' rapor.c:285: error: expected expression before 'const' rapor.c:285: error: expected expression before 'const' rapor.c:285: error: expected expression before 'const' rapor.c:285: error: expected expression before 'const' rapor.c:305: error: expected ';' before '__s1_len' rapor.c:305: warning: incompatible implicit declaration of built-in function 'strlen' rapor.c:305: error: expected expression before 'const' rapor.c:305: error: expected expression before 'const' rapor.c:305: error: expected expression before 'const' rapor.c:305: error: expected expression before 'const' rapor.c:305: error: expected expression before 'const' rapor.c:305: error: expected expression before 'const' rapor.c:305: error: expected expression before 'const' rapor.c:305: error: expected expression before 'const' rapor.c:305: error: expected expression before 'const' rapor.c:305: error: expected expression before 'const' rapor.c:305: error: expected expression before 'const' rapor.c:305: error: expected expression before 'const' rapor.c:332: error: expected ';' before '__s1_len' rapor.c:332: warning: incompatible implicit declaration of built-in function 'strlen' rapor.c:332: error: expected expression before 'const' rapor.c:332: error: expected expression before 'const' rapor.c:332: error: expected expression before 'const' rapor.c:332: error: expected expression before 'const' rapor.c:332: error: expected expression before 'const' rapor.c:332: error: expected expression before 'const' rapor.c:332: error: expected expression before 'const' rapor.c:332: error: expected expression before 'const' rapor.c:332: error: expected expression before 'const' rapor.c:332: error: expected expression before 'const' rapor.c:332: error: expected expression before 'const' rapor.c:332: error: expected expression before 'const' rapor.c:334: error: expected ';' before '__s1_len' rapor.c:334: warning: incompatible implicit declaration of built-in function 'strlen' rapor.c:334: error: expected expression before 'const' rapor.c:334: error: expected expression before 'const' rapor.c:334: error: expected expression before 'const' rapor.c:334: error: expected expression before 'const' rapor.c:334: error: expected expression before 'const' rapor.c:334: error: expected expression before 'const' rapor.c:334: error: expected expression before 'const' rapor.c:334: error: expected expression before 'const' rapor.c:334: error: expected expression before 'const' rapor.c:334: error: expected expression before 'const' rapor.c:334: error: expected expression before 'const' rapor.c:334: error: expected expression before 'const' rapor.c:336: error: expected ';' before '__s1_len' rapor.c:336: warning: incompatible implicit declaration of built-in function 'strlen' rapor.c:336: error: expected expression before 'const' rapor.c:336: error: expected expression before 'const' rapor.c:336: error: expected expression before 'const' rapor.c:336: error: expected expression before 'const' rapor.c:336: error: expected expression before 'const' rapor.c:336: error: expected expression before 'const' rapor.c:336: error: expected expression before 'const' rapor.c:336: error: expected expression before 'const' rapor.c:336: error: expected expression before 'const' rapor.c:336: error: expected expression before 'const' rapor.c:336: error: expected expression before 'const' rapor.c:336: error: expected expression before 'const' rapor.c: In function 'conf_chansno': rapor.c:369: error: 'size_t' undeclared (first use in this function) rapor.c:369: error: expected ';' before '__s1_len' rapor.c:369: error: '__s1_len' undeclared (first use in this function) rapor.c:369: warning: incompatible implicit declaration of built-in function 'strlen' rapor.c:369: error: '__s2_len' undeclared (first use in this function) rapor.c:369: error: expected expression before 'const' rapor.c:369: error: expected expression before 'const' rapor.c:369: error: expected expression before 'const' rapor.c:369: error: expected expression before 'const' rapor.c:369: error: expected expression before 'const' rapor.c:369: error: expected expression before 'const' rapor.c:369: error: expected expression before 'const' rapor.c:369: error: expected expression before 'const' rapor.c:369: error: expected expression before 'const' rapor.c:369: error: expected expression before 'const' rapor.c:369: error: expected expression before 'const' rapor.c:369: error: expected expression before 'const' rapor.c:373: error: expected ';' before '__s1_len' rapor.c:373: warning: incompatible implicit declaration of built-in function 'strlen' rapor.c:373: error: expected expression before 'const' rapor.c:373: error: expected expression before 'const' rapor.c:373: error: expected expression before 'const' rapor.c:373: error: expected expression before 'const' rapor.c:373: error: expected expression before 'const' rapor.c:373: error: expected expression before 'const' rapor.c:373: error: expected expression before 'const' rapor.c:373: error: expected expression before 'const' rapor.c:373: error: expected expression before 'const' rapor.c:373: error: expected expression before 'const' rapor.c:373: error: expected expression before 'const' rapor.c:373: error: expected expression before 'const' rapor.c:375: warning: assignment makes pointer from integer without a cast rapor.c:376: error: expected expression before 'const' rapor.c:376: error: expected expression before 'const' rapor.c:376: warning: incompatible implicit declaration of built-in function 'calloc' rapor.c:376: error: expected ';' before '__len' rapor.c:376: warning: incompatible implicit declaration of built-in function 'malloc' rapor.c:376: error: '__len' undeclared (first use in this function) rapor.c:376: error: too many arguments to function 'memcpy' rapor.c:386: error: expected ';' before '__s1_len' rapor.c:386: warning: incompatible implicit declaration of built-in function 'strlen' rapor.c:386: error: expected expression before 'const' rapor.c:386: error: expected expression before 'const' rapor.c:386: error: expected expression before 'const' rapor.c:386: error: expected expression before 'const' rapor.c:386: error: expected expression before 'const' rapor.c:386: error: expected expression before 'const' rapor.c:386: error: expected expression before 'const' rapor.c:386: error: expected expression before 'const' rapor.c:386: error: expected expression before 'const' rapor.c:386: error: expected expression before 'const' rapor.c:386: error: expected expression before 'const' rapor.c:386: error: expected expression before 'const' rapor.c:388: error: expected ';' before '__s1_len' rapor.c:388: warning: incompatible implicit declaration of built-in function 'strlen' rapor.c:388: error: expected expression before 'const' rapor.c:388: error: expected expression before 'const' rapor.c:388: error: expected expression before 'const' rapor.c:388: error: expected expression before 'const' rapor.c:388: error: expected expression before 'const' rapor.c:388: error: expected expression before 'const' rapor.c:388: error: expected expression before 'const' rapor.c:388: error: expected expression before 'const' rapor.c:388: error: expected expression before 'const' rapor.c:388: error: expected expression before 'const' rapor.c:388: error: expected expression before 'const' rapor.c:388: error: expected expression before 'const' rapor.c:390: error: expected ';' before '__s1_len' rapor.c:390: warning: incompatible implicit declaration of built-in function 'strlen' rapor.c:390: error: expected expression before 'const' rapor.c:390: error: expected expression before 'const' rapor.c:390: error: expected expression before 'const' rapor.c:390: error: expected expression before 'const' rapor.c:390: error: expected expression before 'const' rapor.c:390: error: expected expression before 'const' rapor.c:390: error: expected expression before 'const' rapor.c:390: error: expected expression before 'const' rapor.c:390: error: expected expression before 'const' rapor.c:390: error: expected expression before 'const' rapor.c:390: error: expected expression before 'const' rapor.c:390: error: expected expression before 'const' rapor.c: In function 'get_flag_names': rapor.c:409: error: too many arguments to function 'memset' rapor.c:415: warning: incompatible implicit declaration of built-in function 'strlen' rapor.c:422: warning: incompatible implicit declaration of built-in function 'strlen' rapor.c: In function 'cb_mode': rapor.c:559: warning: passing argument 2 of 'snprintf' makes pointer from integer without a cast rapor.c: In function 'cb_connect': rapor.c:575: warning: passing argument 2 of 'snprintf' makes pointer from integer without a cast rapor.c: In function 'cb_quit': rapor.c:586: warning: passing argument 2 of 'snprintf' makes pointer from integer without a cast rapor.c: In function 'cb_join': rapor.c:596: warning: passing argument 2 of 'snprintf' makes pointer from integer without a cast rapor.c: In function 'cb_kick': rapor.c:605: warning: passing argument 2 of 'snprintf' makes pointer from integer without a cast rapor.c: In function 'cb_nickchange': rapor.c:614: warning: passing argument 2 of 'snprintf' makes pointer from integer without a cast rapor.c: In function 'cb_part': rapor.c:624: warning: passing argument 2 of 'snprintf' makes pointer from integer without a cast rapor.c: In function 'cb_server_connect': rapor.c:649: warning: passing argument 2 of 'snprintf' makes pointer from integer without a cast rapor.c: In function 'cb_server_quit': rapor.c:663: warning: passing argument 2 of 'snprintf' makes pointer from integer without a cast rapor.c: In function 'cb_topic': rapor.c:672: warning: passing argument 2 of 'snprintf' makes pointer from integer without a cast make[2]: *** [custommodule] Error 1 make[2]: Leaving directory `/home/bilimcha/Unreal3.2/src/modules' make[1]: *** [custommodule] Error 2 make[1]: Leaving directory `/home/bilimcha/Unreal3.2/src' make: *** [custommodule] Error 2


  Alıntı ile Cevapla

Cevapla

Etiketler
moduller, unreal, unreal323

Seçenekler
Stil

Yetkileriniz
Konu Acma Yetkiniz Yok
Cevap Yazma Yetkiniz Yok
Eklenti Yükleme Yetkiniz Yok
Mesajınızı Değiştirme Yetkiniz Yok

BB code is Açık
Smileler Açık
[IMG] Kodları Açık
HTML-Kodu Kapalı
Trackbacks are Kapalı
Pingbacks are Açık
Refbacks are Açık


Benzer Konular
Konu Konuyu Başlatan Forum Cevaplar Son Mesaj
Unreal3.2.3 aSi_GeNçx Unreal IRCd 4 07 Ocak 2009 15:54
UnrealIRCd Yeni Moduller MavipikSeL Unreal IRCd 18 05 Ağustos 2007 21:49
Sunucuya Hangi Moduller Kurulmalı california Unreal IRCd 4 26 Mart 2007 10:46